Org.apache.spark.sparkexception job aborted due to stage failure

May 20, 2019 · SparkException: Python wo

May 20, 2019 · SparkException: Python worker failed to connect back when execute spark action 4 Pyspark. spark.SparkException: Job aborted due to stage failure: Task 0 in stage 15.0 failed 1 times, java.net.SocketException: Connection reset Go into the cluster settings, under Advanced select spark and paste spark.driver.maxResultSize 0 (for unlimited) or whatever the value suits you. Using 0 is not recommended. You should optimize the job by re partitioning. For more details, refer "Spark Configurations - Application Properties". Hope this helps. Do let us know if you any further ...Teams. Q&A for work. Connect and share knowledge within a single location that is structured and easy to search. Learn more about Teams

Did you know?

org.apache.spark.SparkException: Job aborted due to stage failure: Task 0 in stage 1486.0 failed 4 times, most recent failure: Lost task 0.3 in stage 1486.0 (TID 1665) (10.116.129.142 executor 0): org.apache.spark.SparkException: Failed to store executor broadcast spark_join_relation_469_-315473829 in BlockManager.Mar 24, 2018 · Here is the full list of commands creating the list, writing it to HDFS and finally printing out the results on the console using hdfs: spark-shell. After the shell has started you type: val nums = sc.parallelize (List (1,2,3,4,5)) nums.saveAsTextFile ("/tmp/simple_list") :quit. Now we read the data from HDFS (Hadoop File System): Exception in thread "main" org.apache.spark.SparkException : Job aborted due to stage failure: Task 3 in stage 0.0 failed 4 times, most recent failure: Lost task 3.3 in stage 0.0 (TID 14, 192.168.10.38): ExecutorLostFailure (executor 3 lost) Driver stacktrace:Jan 3, 2022 · Based on the code , am not seeing anything wrong . Still you can analysis this issue based on the following data related . Make sure 4th line lines rdd has the data based on the collect(). spark.shuffle.consolidateFiles will only help if you override the default to use HashShuffleManager instead of the default HashShuffleManager enabled by default after Spark 1.2 (which defaults to spark.shuffle.manager=sort), and I think does not even apply to Spark 2.x –Hi! I run 2 to spark an option SPARK_MAJOR_VERSION=2 pyspark --master yarn --verbose spark starts, I run the SC and get an error, the field in the table exactly there. not the problem SPARK_MAJOR_VERSION=2 pyspark --master yarn --verbose SPARK_MAJOR_VERSION is set to 2, using Spark2 Python 2.7.12 ...Mar 30, 2020 · org.apache.spark.SparkException: Job aborted due to stage failure: Task 29 in stage 0.0 failed 4 times, most recent failure: Lost task 29.3 in stage 0.0 (TID 92, 10.252.252.125, executor 23): ExecutorLostFailure (executor 23 exited caused by one of the running tasks) Reason: Remote RPC client disassociated. Part of Microsoft Azure Collective. 0. Caused by: org.apache.spark.SparkException: Job aborted due to stage failure: Task 5 in stage 76.0 failed 4 times, most recent failure: Lost task 5.3 in stage 76.0 (TID 2334) (10.139.64.5 executor 6): com.databricks.sql.io.FileReadException: Error while reading file <File_Path> It is possible the ...But failed with 10GB file. My dataproc has 1 master with 4CPU, 26GB memory, 500GB disk. 5 workers with same config. I guess it should've been able to handle 10GB data. My command is toDatabase.repartition (10).write.json ("gs://mypath") Error is. org.apache.spark.SparkException: Job aborted. at org.apache.spark.sql.execution.datasources ...org.apache.spark.SparkException: Job aborted due to stage failure: Total size of serialized results of 69 tasks (4.0 GB) is bigger than spark.driver.maxResultSize (4.0 GB) 08-23-2021 07:48 AM. set spark.conf.set ("spark.driver.maxResultSize", "20g") get spark.conf.get ("spark.driver.maxResultSize") // 20g which is expected in notebook , I did ...Here are some ideas to fix this error: Serializable the class. Declare the instance only within the lambda function passed in map. Make the NotSerializable object as a static and create it once per machine. Call rdd.forEachPartition and create the NotSerializable object in there like this: rdd.forEachPartition (iter -> { NotSerializable ...Sep 1, 2022 · use dbr version : 10.4 LTS (includes Apache Spark 3.2.1, Scala 2.12) for spark configuartion edit the spark tab by editing the cluster and use below code there. "spark.sql.ansi.enabled false" May 15, 2017 · : org.apache.spark.SparkException: Job aborted due to stage failure: Serialized task 302987:27 was 139041896 bytes, which exceeds max allowed: spark.akka.frameSize (134217728 bytes) - reserved (204800 bytes). org.apache.spark.SparkException: **Job aborted due to stage failure: Task 0 in stage 1.0 failed 1 times, most recent failure: Lost task 0.0 in stage 1.0 (TID 1 ...Feb 24, 2022 · Caused by: org.apache.spark.SparkException: Job aborted due to stage failure: Task 5 in stage 76.0 failed 4 times, most recent failure: Lost task 5.3 in stage 76.0 (TID 2334) (10.139.64.5 executor 6): com.databricks.sql.io.FileReadException: Error while reading file <File_Path> It is possible the underlying files have been updated. Teams. Q&A for work. Connect and share knowledge within a single location that is structured and easy to search. Learn more about TeamsMay 2, 2016 · Teams. Q&A for work. Connect and share knowledge within a single location that is structured and easy to search. Learn more about Teams calling o110726.collectToPython. : org.apache.spark.SparkException: Job aborted due to stage failure: Task 7 in stage 1971.0 failed 4 times, most recent failure: Lost task 7.3 in stage 1971.0 (TID 31298) (10.54.144.30 executor 7):

Sep 21, 2021 · I am trying to solve the problems from O'Reilly book of Learning Spark. Below part of code is working fine from pyspark.sql.types import * from pyspark.sql import SparkSession from pyspark.sql.func... Jan 16, 2023 · If issue persists, please contact Microsoft support for further assistance","Details":"org.apache.spark.SparkException: Job aborted due to stage failure: Task 320 in stage 21.0 failed 1 times, most recent failure: Lost task 320.0 in stage 21.0 (TID 1297, vm-42929650, executor 1): ExecutorLostFailure (executor 1 exited caused by one of the ... Apr 9, 2021 · Viewed 8k times. 1. I am trying to do some computation using UDFs. But after the computation when i try to convert the pyspark dataframe to pandas it gives me org.apache.spark.SparkException: Exception thrown in awaitResult: I will put down the reproducible code. import pandas as pd import numpy as np import time n = 10000 sample_df = pd ... Mar 31, 2019 · org.apache.spark.SparkException: Job aborted due to stage failure: Task in stage failed,Lost task in stage : ExecutorLostFailure (executor 4 lost) Ask Question Asked 4 years, 5 months ago

不知道是什么原因。. (利用 Spark-submit 提交 参数都正常). 但是 集群上的版本是1.5,和2.0都无法跑出来结果,但是1.3就能出结果, 所以目前确定是 Spark 1.5以上的版本对协同过滤算法不兼容引起,具体原因不详。. task倾斜原因比较多,网络io,cpu,mem都有可能造成 ... I am doing it using spark code. But when i try to run the code I get following exception org.apache.spark.SparkException: Job aborted due to stage failure: Task 2 in stage 1.0 failed 4 times, most recent failure: Lost task 2.3 in stage 1.0 (TID 9, XXXX.XXX.XXX.local): org.apache.spark.SparkException: Task failed while writing rows.hello everyone I am working on PySpark Python and I have mentioned the code and getting some issue, I am wondering if someone knows about the following issue? windowSpec = Window.partitionBy(…

Reader Q&A - also see RECOMMENDED ARTICLES & FAQs. Apache Spark; koukou. ... org.apache.spark.SparkExc. Possible cause: Apache Spark; koukou. ... org.apache.spark.SparkException: Job aborted due to stage.

Saved searches Use saved searches to filter your results more quicklyorg.apache.spark.SparkException: Job aborted due to stage failure: Task 29 in stage 0.0 failed 4 times, most recent failure: Lost task 29.3 in stage 0.0 (TID 92, 10.252.252.125, executor 23): ExecutorLostFailure (executor 23 exited caused by one of the running tasks) Reason: Remote RPC client disassociated.

I'm new to spark, and was trying to run the example JavaSparkPi.java, it runs well, but because i have to use this in another java s I copy all things from main to a method in the class and try to call the method in main, it saids . org.apache.spark.SparkException: Job aborted: Task not serializable: java.io.NotSerializableExceptionNov 15, 2021 · Job aborted due to stage failure: Task 5 in stage 3.0 failed 1 times 8 Exception: Java gateway process exited before sending the driver its port number while creating a Spark Session in Python

I'm new to spark, and was trying to run the exampl Apr 15, 2021 · The copy activity was interrupted part way through as the source database went offline which then caused the failure to complete writing the files properly. These were easily found as they were the most recently modified files. I am trying to run a pyspark job but it is failing on RDD collectAndJan 4, 2019 · Exception in thread "main" org.apache.spark. Part of Microsoft Azure Collective. 0. Caused by: org.apache.spark.SparkException: Job aborted due to stage failure: Task 5 in stage 76.0 failed 4 times, most recent failure: Lost task 5.3 in stage 76.0 (TID 2334) (10.139.64.5 executor 6): com.databricks.sql.io.FileReadException: Error while reading file <File_Path> It is possible the ... Mar 24, 2018 · Here is the full list of comm org.apache.spark.shuffle.MetadataFetchFailedException: Missing an output location for shuffle 0 解决方法:这种问题一般发生在有大量shuffle操作的时候,task不断的failed,然后又重执行,一直循环下去,直到application失败。: org.apache.spark.SparkException: Job aborted due to stage failure: Task 9 in stage 47.0 failed 4 times, most recent failure: Lost task 9.3 in stage 47.0 (TID 2256, ip-172-31-00-00.eu-west-1.compute.internal, executor 10): org.apache.spark.sql.execution.QueryExecutionException: Parquet column cannot be converted in file s3a://bucket/prod ... Jun 25, 2020 · Apache Spark; koukou. ... org.apache.spark.SparkENov 11, 2021 · 1 Answer. PySpark DF are lazy loading. WhenFeb 1, 2017 · Pyspark. spark.SparkException: Job aborted due Apr 15, 2021 · The copy activity was interrupted part way through as the source database went offline which then caused the failure to complete writing the files properly. These were easily found as they were the most recently modified files. 不知道是什么原因。. (利用 Spark-submit 提交 参数都正常). 但是 集群上的版本是1.5,和2.0都无法跑 Jan 10, 2020 · Teams. Q&A for work. Connect and share knowledge within a single location that is structured and easy to search. Learn more about Teams Jan 3, 2022 · Based on the code , am not seeing anything wrong . Still you can analysis this issue based on the following data related . Make sure 4th line lines rdd has the data based on the collect(). >>Job aborted due to stage failure: Total size of seri[Check your data for null where not null should be present and eSparkException:执行 spark 操作时 Python 工作线程无法连接回spark.Spar hello everyone I am working on PySpark Python and I have mentioned the code and getting some issue, I am wondering if someone knows about the following issue? windowSpec = Window.partitionBy(